BDBM50451424 CHEMBL4205584
SMILES CS(=O)(=O)N1CCN(Cc2nc3c(nc(-c4cnc(N)nc4)c(Cl)n3n2)N2CCOCC2)CC1
InChI Key InChIKey=IZSUSVHQPBIXPL-UHFFFAOYSA-N
Data  5 KI  1 IC50
  Tab Delimited (TSV)   2D SDfile   Computed 3D by Vconf -m prep SDfile
Find this compound or compounds like it in BindingDB:
Activity Spreadsheet -- Enzyme Inhibition Constant Data from BindingDB
Found 6 hits for monomerid = 50451424
TargetPhosphatidylinositol 3-kinase regulatory subunit alpha/4,5-bisphosphate 3-kinase catalytic subunit delta isoform(Homo sapiens (Human))
Spanish National Cancer Research Centre (Cnio)
Curated by ChEMBL
LigandPNGBDBM50451424(CHEMBL4205584)
Affinity DataKi:  3.40nM. Assay description: Inhibition of recombinant human full-length N-terminal His6-tagged p110delta/human full-length p85alpha expressed in baculovirus infected Sf21 insect...
Ligand InfoPC cidPC sid
In DepthDetails ArticlePubMed
TargetPhosphatidylinositol 3-kinase regulatory subunit alpha/4,5-bisphosphate 3-kinase catalytic subunit alpha isoform(Homo sapiens (Human))
Spanish National Cancer Research Centre (Cnio)
Curated by ChEMBL
LigandPNGBDBM50451424(CHEMBL4205584)
Affinity DataKi:  5.5nM. Assay description: Inhibition of full-length human P110alpha (1 to 1068 residues)/N-terminal GST-fused p85alpha (1 to 724 residues) expressed in baculovirus expression ...
Ligand InfoPC cidPC sid
In DepthDetails ArticlePubMed
TargetPhosphatidylinositol 4,5-bisphosphate 3-kinase catalytic subunit gamma isoform(Homo sapiens (Human))
Spanish National Cancer Research Centre (Cnio)
Curated by ChEMBL
LigandPNGBDBM50451424(CHEMBL4205584)
Affinity DataKi:  42nM. Assay description: Inhibition of recombinant full-length human N-terminal His6-tagged p110gamma expressed in baculovirus infected Sf21 insect cells using PIP2 as substr...
Ligand InfoPC cidPC sid
In DepthDetails ArticlePubMed
TargetPhosphatidylinositol 3-kinase regulatory subunit alpha/4,5-bisphosphate 3-kinase catalytic subunit beta isoform(Homo sapiens (Human))
Spanish National Cancer Research Centre (Cnio)
Curated by ChEMBL
LigandPNGBDBM50451424(CHEMBL4205584)
Affinity DataKi:  285nM. Assay description: Inhibition of p110beta/85alpha (unknown origin) using PIP2 as substrate by HTRF assay
Ligand InfoPC cidPC sid
In DepthDetails ArticlePubMed
TargetSerine/threonine-protein kinase mTOR(Homo sapiens (Human))
Spanish National Cancer Research Centre (Cnio)
Curated by ChEMBL
LigandPNGBDBM50451424(CHEMBL4205584)
Affinity DataKi:  8.17E+3nM. Assay description: Inhibition of recombinant human GST-tagged mTOR catalytic domain (1360 to 2549 residues) expressed in baculovirus expression system by AlexaFluor647-...
Ligand InfoPC cidPC sid
In DepthDetails ArticlePubMed
TargetPotassium voltage-gated channel subfamily H member 2(Homo sapiens (Human))
Spanish National Cancer Research Centre (Cnio)
Curated by ChEMBL
LigandPNGBDBM50451424(CHEMBL4205584)
Affinity DataIC50: >3.00E+4nM. Assay description: Inhibition of human ERG by Tracer Red dye based fluorescence polarization assay
Ligand InfoPC cidPC sid
In DepthDetails ArticlePubMed