BDBM50451534 CHEMBL4207861
SMILES Cc1cc(C)c2cc(ccc2n1)C(=O)NC1CN(C1)c1ccnc(F)c1F
InChI Key InChIKey=SVLSOTNRZIJTHB-UHFFFAOYSA-N
Data  2 EC50
  Tab Delimited (TSV)   2D SDfile   Computed 3D by Vconf -m prep SDfile
Find this compound or compounds like it in BindingDB:
Activity Spreadsheet -- Enzyme Inhibition Constant Data from BindingDB
Found 2 hits for monomerid = 50451534
TargetMuscarinic acetylcholine receptor M4(RAT)
Vanderbilt University
Curated by ChEMBL
LigandPNGBDBM50451534(CHEMBL4207861)
Affinity DataEC50:  331nM. Assay description: Positive allosteric modulation of rat M4 receptor expressed in CHO cells co-expressing Gqi5 assessed as increase in acetylcholine-induced calcium mob...
Ligand InfoPC cidPC sid
In DepthDetails ArticlePubMed
TargetMuscarinic acetylcholine receptor M4(RAT)
Vanderbilt University
Curated by ChEMBL
LigandPNGBDBM50451534(CHEMBL4207861)
Affinity DataEC50:  332nM. Assay description: Positive allosteric modulation of rat M4 receptor expressed in CHO cells co-expressing Gqi5 assessed as increase in acetylcholine-induced calcium mob...
Ligand InfoPC cidPC sid
In DepthDetails ArticlePubMed