BDBM50451556 CHEMBL3084838
SMILES N[C@H]1CC[C@@H](CC1)Nc1nc(Nc2ccc(cc2)P(O)(=O)CP(O)(O)=O)c2ncn(C3CCCC3)c2n1
InChI Key InChIKey=VTPXOIYVGVSQFZ-JCNLHEQBSA-N
Data  1 IC50
  Tab Delimited (TSV)   2D SDfile   Computed 3D by Vconf -m prep SDfile
Find this compound or compounds like it in BindingDB:
Activity Spreadsheet -- Enzyme Inhibition Constant Data from BindingDB
Found 1 hit for monomerid = 50451556
TargetProto-oncogene tyrosine-protein kinase Src(Homo sapiens (Human))
Ariad Pharmaceuticals
Curated by ChEMBL
LigandPNGBDBM50451556(CHEMBL3084838)
Affinity DataIC50:  41nM. Assay description: Inhibition of Src-mediated dentine resorption in rabbit-osteoclast assay
In DepthDetails ArticlePubMed