BDBM50451559 CHEMBL102550
SMILES OP(O)(=O)CP(O)(=O)CCCNc1nc(Nc2ccccc2)c2ncn(C3CCCC3)c2n1
InChI Key InChIKey=KXQJOSUYJXZIHG-UHFFFAOYSA-N
Data  1 IC50
  Tab Delimited (TSV)   2D SDfile   Computed 3D by Vconf -m prep SDfile
Find this compound or compounds like it in BindingDB:
Activity Spreadsheet -- Enzyme Inhibition Constant Data from BindingDB
Found 1 hit for monomerid = 50451559
TargetProto-oncogene tyrosine-protein kinase Src(Homo sapiens (Human))
Ariad Pharmaceuticals
Curated by ChEMBL
LigandPNGBDBM50451559(CHEMBL102550)
Affinity DataIC50:  5.23E+3nM. Assay description: Inhibition of Src-mediated dentine resorption in rabbit-osteoclast assay
In DepthDetails ArticlePubMed