BDBM50451768 CHEMBL161772
SMILES N=C(NCc1ccccc1)c1ccc2ccccc2c1
InChI Key InChIKey=UOGUAODRHCJVGQ-UHFFFAOYSA-N
Data  1 KI
  Tab Delimited (TSV)   2D SDfile   Computed 3D by Vconf -m prep SDfile
Find this compound or compounds like it in BindingDB:
Activity Spreadsheet -- Enzyme Inhibition Constant Data from BindingDB
Found 1 hit for monomerid = 50451768
TargetGlutamate receptor ionotropic, NMDA 1/2B(Homo sapiens (Human))
Merck Sharp & Dohme Research Laboratories
Curated by ChEMBL
LigandPNGBDBM50451768(CHEMBL161772)
Affinity DataKi:  32nM. Assay description: Displacement of [3H]ifenprodil binding to recombinant human NR1a/NR2B receptors expressed in L(tk-) cells
In DepthDetails ArticlePubMed