BDBM50451939 CHEMBL2112510
SMILES CC(C)OC(=O)[C@H]1CC2C[C@@H](CC1N2C)OC(c1ccc(F)cc1)c1ccc(F)cc1
InChI Key InChIKey=ZWDUVGVCDMVALX-NULCOVKLSA-N
Data  4 KI
  Tab Delimited (TSV)   2D SDfile   Computed 3D by Vconf -m prep SDfile
Find this compound or compounds like it in BindingDB:
Activity Spreadsheet -- Enzyme Inhibition Constant Data from BindingDB
Found 4 hits for monomerid = 50451939
TargetSodium-dependent dopamine transporter(Rattus norvegicus (rat))
National Institute On Drug Abuse-Intramural Research Program
Curated by ChEMBL
LigandPNGBDBM50451939(CHEMBL2112510)
Affinity DataKi:  151nM. Assay description: Displacement of [3H]WIN-35428 from dopamine transporter of rat brain membrane
In DepthDetails ArticlePubMed
TargetMuscarinic acetylcholine receptor M1(RAT)
National Institute On Drug Abuse-Intramural Research Program
Curated by ChEMBL
LigandPNGBDBM50451939(CHEMBL2112510)
Affinity DataKi:  784nM. Assay description: Displacement of [3H]pirenzepine from muscarinic acetylcholine receptor M1 of rat brain membrane
In DepthDetails ArticlePubMed
TargetTransporter(Rattus norvegicus)
National Institute On Drug Abuse-Intramural Research Program
Curated by ChEMBL
LigandPNGBDBM50451939(CHEMBL2112510)
Affinity DataKi:  1.02E+4nM. Assay description: Displacement of [3H]-nisoxatine from norepinephrine transporter of rat brain membrane
In DepthDetails ArticlePubMed
TargetSodium-dependent serotonin transporter(Rattus norvegicus (rat))
National Institute On Drug Abuse-Intramural Research Program
Curated by ChEMBL
LigandPNGBDBM50451939(CHEMBL2112510)
Affinity DataKi:  1.48E+4nM. Assay description: Displacement of [3H]-citalopram from serotonin transporter of rat brain membrane
In DepthDetails ArticlePubMed