BDBM50452138 CHEMBL2372196
SMILES CC(O)=O.CC(C)C[C@H]1NC(=O)[C@H](Cc2ccccc2)NC(=O)CNC(=O)[C@@H](CCCCNC1=O)NC(=O)[C@@H](N)Cc1ccc(O)cc1
InChI Key InChIKey=FVBMNJRVPFTJGJ-IHBHCIFXSA-N
Data  2 KI  4 IC50
  Tab Delimited (TSV)   2D SDfile   Computed 3D by Vconf -m prep SDfile
Find this compound or compounds like it in BindingDB:
Activity Spreadsheet -- Enzyme Inhibition Constant Data from BindingDB
Found 6 hits for monomerid = 50452138
TargetMu-type opioid receptor(Rattus norvegicus (rat))
TBA
Curated by ChEMBL
LigandPNGBDBM50452138(CHEMBL2372196)
Affinity DataKi:  4.70nM. Assay description: Inhibition of binding of [3H]naloxone to Opioid receptor mu 1 in the rat brain homogenate
In DepthDetails ArticlePubMed
TargetDelta-type opioid receptor(Rattus norvegicus (rat))
TBA
Curated by ChEMBL
LigandPNGBDBM50452138(CHEMBL2372196)
Affinity DataKi:  22nM. Assay description: Inhibition of [3H][D-Ala2,D-Leu5]enkephalin binding to Opioid receptor delta 1 in the rat brain homogenate
In DepthDetails ArticlePubMed
TargetDelta-type opioid receptor(Rattus norvegicus (rat))
TBA
Curated by ChEMBL
LigandPNGBDBM50452138(CHEMBL2372196)
Affinity DataIC50:  48nM. Assay description: Inhibition of binding of [3H][D-Ala2,D-Leu5]enkephalin to Opioid receptor delta 1 in the rat brain homogenate
In DepthDetails ArticlePubMed
TargetMu-type opioid receptor(Rattus norvegicus (rat))
TBA
Curated by ChEMBL
LigandPNGBDBM50452138(CHEMBL2372196)
Affinity DataIC50:  8.5nM. Assay description: Inhibition of binding of [3H]naloxone to Opioid receptor mu 1 in the rat brain homogenate
In DepthDetails ArticlePubMed
TargetMu-type opioid receptor(GUINEA PIG)
TBA
Curated by ChEMBL
LigandPNGBDBM50452138(CHEMBL2372196)
Affinity DataIC50:  2.40nM. Assay description: Inhibitory potency against Opioid receptor mu 1 in the guinea pig ileum assay
In DepthDetails ArticlePubMed
TargetDelta-type opioid receptor(MOUSE)
TBA
Curated by ChEMBL
LigandPNGBDBM50452138(CHEMBL2372196)
Affinity DataIC50:  18nM. Assay description: Inhibitory potency against Opioid receptor delta 1 in the mouse vas deferens assay
In DepthDetails ArticlePubMed