BDBM50452204 CHEMBL2372834
SMILES N[C@@H](Cc1ccc(O)cc1)C(=O)N[C@H]1CCCNC(=O)CC[C@H](NC(=O)CNC1=O)C(N)=O
InChI Key InChIKey=BDLXRHXTYUQFLN-JYJNAYRXSA-N
Data  2 KI
  Tab Delimited (TSV)   2D SDfile   Computed 3D by Vconf -m prep SDfile
Find this compound or compounds like it in BindingDB:
Activity Spreadsheet -- Enzyme Inhibition Constant Data from BindingDB
Found 2 hits for monomerid = 50452204
TargetMu-type opioid receptor(Rattus norvegicus (rat))
TBA
Curated by ChEMBL
LigandPNGBDBM50452204(CHEMBL2372834)
Affinity DataKi:  1.76E+3nM. Assay description: Evaluated for its ability to displace [3H]DAGO binding to Opioid receptor mu 1 from rat brain homogenate
In DepthDetails ArticlePubMed
TargetDelta-type opioid receptor(Rattus norvegicus (rat))
TBA
Curated by ChEMBL
LigandPNGBDBM50452204(CHEMBL2372834)
Affinity DataKi:  4.99E+3nM. Assay description: Displacement of [3H]DSLET from Opioid receptor delta 1 from rat brain homogenate
In DepthDetails ArticlePubMed