BDBM50452266 CHEMBL2115071
SMILES COc1ccc(cc1OC)[C@@H](O)CN1CCN(CC1)c1cccccc1=O
InChI Key InChIKey=SGEKLKJQLHJVDK-IBGZPJMESA-N
Data  2 IC50
  Tab Delimited (TSV)   2D SDfile   Computed 3D by Vconf -m prep SDfile
Find this compound or compounds like it in BindingDB:
Activity Spreadsheet -- Enzyme Inhibition Constant Data from BindingDB
Found 2 hits for monomerid = 50452266
TargetAlpha-1A/Alpha-1B/Alpha-1D adrenergic receptor(Rattus norvegicus (rat))
TBA
Curated by ChEMBL
LigandPNGBDBM50452266(CHEMBL2115071)
Affinity DataIC50:  1.44E+3nM. Assay description: Ability to displace [3H]WB-4101 from rat brain alpha-1 adrenergic receptor
In DepthDetails ArticlePubMed
TargetD(2) dopamine receptor(Rattus norvegicus (rat))
TBA
Curated by ChEMBL
LigandPNGBDBM50452266(CHEMBL2115071)
Affinity DataIC50:  1.66E+4nM. Assay description: Compound was for its ability to displace [3H]-haloperidol binding to rat striatal Dopamine receptor D2
In DepthDetails ArticlePubMed