BDBM50452482 CHEMBL4208104
SMILES CC(=O)Nc1ccc(\C=C\C(=O)N2CCC(C2)c2nccs2)cn1
InChI Key InChIKey=RMCDBOKHZMWFBB-HWKANZROSA-N
Data  1 KI  1 IC50
  Tab Delimited (TSV)   2D SDfile   Computed 3D by Vconf -m prep SDfile
Find this compound or compounds like it in BindingDB:
Activity Spreadsheet -- Enzyme Inhibition Constant Data from BindingDB
Found 2 hits for monomerid = 50452482
TargetEnoyl-[acyl-carrier-protein] reductase [NADPH] FabI [9-251](Staphylococcus aureus)
Novalex Therapeutics
Curated by ChEMBL
LigandPNGBDBM50452482(CHEMBL4208104)
Affinity DataKi:  1.70E+3nM. Assay description: Competitive inhibition of Staphylococcus aureus subsp. aureus Rosenbach ATCC 43300 FabI using crotonyl-CoA as substrate in presence of NADPH/NADH aft...
In DepthDetails ArticlePubMed
TargetEnoyl-[acyl-carrier-protein] reductase [NADPH] FabI [9-251](Staphylococcus aureus)
Novalex Therapeutics
Curated by ChEMBL
LigandPNGBDBM50452482(CHEMBL4208104)
Affinity DataIC50:  4.50E+3nM. Assay description: Inhibition of Staphylococcus aureus subsp. aureus Rosenbach ATCC 43300 FabI using crotonyl-CoA as substrate in presence of NADPH/NADH after 10 mins b...
In DepthDetails ArticlePubMed