BDBM50452486 CHEMBL39263::Rac-Devazepide
SMILES CN1c2ccccc2C(=NC(NC(=O)c2cc3ccccc3[nH]2)C1=O)c1ccccc1
InChI Key InChIKey=NFHRQQKPEBFUJK-UHFFFAOYSA-N
Data  3 IC50
PDB links: 1 PDB ID matches this monomer.
  Tab Delimited (TSV)   2D SDfile   Computed 3D by Vconf -m prep SDfile
Find this compound or compounds like it in BindingDB:
Activity Spreadsheet -- Enzyme Inhibition Constant Data from BindingDB
Found 3 hits for monomerid = 50452486
TargetCholecystokinin receptor type A(RAT)
Merck Sharp & Dohme Research Laboratories
Curated by ChEMBL
LigandPNGBDBM50452486(CHEMBL39263 | Rac-Devazepide)
Affinity DataIC50:  0.800nM. Assay description: Half-maximal inhibition of [125I]CCK-33 binding to cholecystokinin A receptor from rat pancreatic tissue
In DepthDetails ArticlePubMed
TargetCholecystokinin receptor type A/Gastrin/cholecystokinin type B receptor(Homo sapiens (Human))
Merck Sharp & Dohme Research Laboratories
Curated by ChEMBL
LigandPNGBDBM50452486(CHEMBL39263 | Rac-Devazepide)
Affinity DataIC50:  800nM. Assay description: Half-maximal inhibition of [125I]-CCK-8(+) binding to cholecystokinin receptor from guinea pig brain tissue
In DepthDetails ArticlePubMed
TargetGastrin/cholecystokinin type B receptor(Homo sapiens (Human))
Merck Sharp & Dohme Research Laboratories
Curated by ChEMBL
LigandPNGBDBM50452486(CHEMBL39263 | Rac-Devazepide)
Affinity DataIC50:  720nM. Assay description: Half-maximal inhibition of [125I]gastrin binding to guinea pig gastric glands
In DepthDetails ArticlePubMed