BDBM50453069 CHEMBL2367764
SMILES [H][C@]12Cc3ccc(O)cc3[C@@](C)(CCN1C[C@@H]1CCC(=O)O1)[C@H]2C
InChI Key InChIKey=HHASRPPPJAXSNL-FRXJQCMVSA-N
Data  1 IC50
  Tab Delimited (TSV)   2D SDfile   Computed 3D by Vconf -m prep SDfile
Find this compound or compounds like it in BindingDB:
Activity Spreadsheet -- Enzyme Inhibition Constant Data from BindingDB
Found 1 hit for monomerid = 50453069
TargetKappa-type opioid receptor(Cavia porcellus (domestic guinea pig))
University Of Washington
Curated by ChEMBL
LigandPNGBDBM50453069(CHEMBL2367764)
Affinity DataIC50:  7.30nM. Assay description: Displacement of [3H]-bremazocine from opioid receptor kappa of guinea pig membrane.
In DepthDetails ArticlePubMed