BDBM50453374 CHEMBL67378
SMILES CCN(CC)C(=O)c1ccc(cc1)[C@@H](N1C[C@H](C)N(CC=C)C[C@H]1C)c1cccc(OC)c1
InChI Key InChIKey=KQWVAUSXZDRQPZ-OREGWCPLSA-N
Data  4 IC50
  Tab Delimited (TSV)   2D SDfile   Computed 3D by Vconf -m prep SDfile
Find this compound or compounds like it in BindingDB:
Activity Spreadsheet -- Enzyme Inhibition Constant Data from BindingDB
Found 4 hits for monomerid = 50453374
TargetMu-type opioid receptor(Rattus norvegicus (rat))
National Institute Of Diabetes And Digestive And Kidney Diseases
Curated by ChEMBL
LigandPNGBDBM50453374(CHEMBL67378)
Affinity DataIC50:  9.14E+3nM. Assay description: Evaluated for inhibition of [3H]DAMGO binding from mu receptor in rat brain membranes
In DepthDetails ArticlePubMed
TargetDelta-type opioid receptor(MOUSE)
National Institute Of Diabetes And Digestive And Kidney Diseases
Curated by ChEMBL
LigandPNGBDBM50453374(CHEMBL67378)
Affinity DataIC50:  31nM. Assay description: Tested for agonist activity against delta opioid receptor mouse vas deferens
In DepthDetails ArticlePubMed
TargetDelta-type opioid receptor(MOUSE)
National Institute Of Diabetes And Digestive And Kidney Diseases
Curated by ChEMBL
LigandPNGBDBM50453374(CHEMBL67378)
Affinity DataIC50:  3.5nM. Assay description: Tested for inhibition of binding of [3H]DADLE to mouse brain membranes depleted of mu binding sites by pretreatment with irreversible ligand BIT for ...
In DepthDetails ArticlePubMed
TargetMu-type opioid receptor(GUINEA PIG)
National Institute Of Diabetes And Digestive And Kidney Diseases
Curated by ChEMBL
LigandPNGBDBM50453374(CHEMBL67378)
Affinity DataIC50:  1.52E+3nM. Assay description: Tested for agonist activity against mu opioid receptor in guinea pig ileum
In DepthDetails ArticlePubMed