BDBM50453378 CHEMBL2114114
SMILES CC(C)COC(=O)CNC(=O)C(CN1CCC(CC1)c1cccc(O)c1)Cc1ccccc1
InChI Key InChIKey=FOMXWLMRNKMHNU-UHFFFAOYSA-N
Data  1 KI
  Tab Delimited (TSV)   2D SDfile   Computed 3D by Vconf -m prep SDfile
Find this compound or compounds like it in BindingDB:
Activity Spreadsheet -- Enzyme Inhibition Constant Data from BindingDB
Found 1 hit for monomerid = 50453378
TargetMu-type opioid receptor(Rattus norvegicus (rat))
Eli Lilly
Curated by ChEMBL
LigandPNGBDBM50453378(CHEMBL2114114)
Affinity DataKi:  4nM. Assay description: Tested for binding affinity towards mu receptor in presence of [3H]-NAL radioligand
In DepthDetails ArticlePubMed