BDBM50453605 CHEMBL172449
SMILES ONC(=O)c1cc(NCc2cc(O)ccc2O)ccc1O
InChI Key InChIKey=CVLIKWREJQZPKH-UHFFFAOYSA-N
Data  2 IC50
  Tab Delimited (TSV)   2D SDfile   Computed 3D by Vconf -m prep SDfile
Find this compound or compounds like it in BindingDB:
Activity Spreadsheet -- Enzyme Inhibition Constant Data from BindingDB
Found 2 hits for monomerid = 50453605
TargetEpidermal growth factor receptor(Homo sapiens (Human))
University Of Paris
Curated by ChEMBL
LigandPNGBDBM50453605(CHEMBL172449)
Affinity DataIC50:  4.00E+4nM. Assay description: Inhibition of EGF-stimulated DNA synthesis in ER22 cells, by measuring [3H]Me-dT incorporation into ER 22 cells
In DepthDetails ArticlePubMed
TargetEpidermal growth factor receptor(Homo sapiens (Human))
University Of Paris
Curated by ChEMBL
LigandPNGBDBM50453605(CHEMBL172449)
Affinity DataIC50:  400nM. Assay description: Inhibitory potency against protein tyrosine kinase activity associated with EGFR was evaluated using ER 22 cell membrane
In DepthDetails ArticlePubMed