BDBM50453661 CHEMBL2113691
SMILES COc1nc(NCc2cccc(I)c2)c2ncn(C)c2n1
InChI Key InChIKey=ISRXYCXDEAVHOY-UHFFFAOYSA-N
Data  3 KI
  Tab Delimited (TSV)   2D SDfile   Computed 3D by Vconf -m prep SDfile
Find this compound or compounds like it in BindingDB:
Activity Spreadsheet -- Enzyme Inhibition Constant Data from BindingDB
Found 3 hits for monomerid = 50453661
TargetAdenosine receptor A1(Rattus norvegicus (rat))
National Institute Of Diabetes
Curated by ChEMBL
LigandPNGBDBM50453661(CHEMBL2113691)
Affinity DataKi:  500nM. Assay description: Binding affinity against adenosine A1 receptor from rat brain.
In DepthDetails ArticlePubMed
TargetAdenosine receptor A2a(Rattus norvegicus (rat))
National Institute Of Diabetes
Curated by ChEMBL
LigandPNGBDBM50453661(CHEMBL2113691)
Affinity DataKi:  1.24E+3nM. Assay description: Binding affinity against adenosine A2A receptor from rat brain.
In DepthDetails ArticlePubMed
TargetAdenosine receptor A3(Rattus norvegicus)
National Institute Of Diabetes
Curated by ChEMBL
LigandPNGBDBM50453661(CHEMBL2113691)
Affinity DataKi:  1.83E+4nM. Assay description: Binding affinity against adenosine A3 receptor from rat brain.
In DepthDetails ArticlePubMed