BDBM50453904 CHEMBL3084892
SMILES [H][C@]12CC[C@]([H])(C[C@@H](C1)OC(c1ccccc1)c1ccc(Cl)c(Cl)c1)N2C
InChI Key InChIKey=XDGMWESKBRLBKW-TWYXQDJOSA-N
Data  4 KI  1 IC50
  Tab Delimited (TSV)   2D SDfile   Computed 3D by Vconf -m prep SDfile
Find this compound or compounds like it in BindingDB:
Activity Spreadsheet -- Enzyme Inhibition Constant Data from BindingDB
Found 5 hits for monomerid = 50453904
TargetMuscarinic acetylcholine receptor M1(RAT)
National Institutes Of Health
Curated by ChEMBL
LigandPNGBDBM50453904(CHEMBL3084892)
Affinity DataKi:  13nM. Assay description: Affinity for rat M1 acetylcholine receptor using [3H]pirenzepine displacement.
In DepthDetails ArticlePubMed
TargetSodium-dependent dopamine transporter(Rattus norvegicus (rat))
National Institutes Of Health
Curated by ChEMBL
LigandPNGBDBM50453904(CHEMBL3084892)
Affinity DataKi:  21nM. Assay description: Affinity for rat dopamine transporter using [3H]WIN-35428 displacement.
In DepthDetails ArticlePubMed
TargetSodium-dependent dopamine transporter(Rattus norvegicus (rat))
National Institutes Of Health
Curated by ChEMBL
LigandPNGBDBM50453904(CHEMBL3084892)
Affinity DataKi:  21nM. Assay description: Binding affinity to dopamine transporter (DAT) using [3H]WIN-35428 as a radioligand
In DepthDetails ArticlePubMed
TargetMuscarinic acetylcholine receptor M2(RAT)
National Institutes Of Health
Curated by ChEMBL
LigandPNGBDBM50453904(CHEMBL3084892)
Affinity DataKi:  141nM. Assay description: Affinity for rat M1 acetylcholine receptor using [3H]-AF DX 384 displacement.
In DepthDetails ArticlePubMed
TargetSodium-dependent dopamine transporter(Rattus norvegicus (rat))
National Institutes Of Health
Curated by ChEMBL
LigandPNGBDBM50453904(CHEMBL3084892)
Affinity DataIC50:  47nM. Assay description: Inhibition of [3H]dopamine uptake in rat caudate putamen.
In DepthDetails ArticlePubMed