BDBM50454011 CHEMBL359136
SMILES CC(COC(=O)c1ccc(cc1)-c1cc(O)cc(c1)C(C)(C)C)CC(C)(C)C
InChI Key InChIKey=KZNCKTMBABZLOD-UHFFFAOYSA-N
Data  1 IC50
  Tab Delimited (TSV)   2D SDfile   Computed 3D by Vconf -m prep SDfile
Find this compound or compounds like it in BindingDB:
Activity Spreadsheet -- Enzyme Inhibition Constant Data from BindingDB
Found 1 hit for monomerid = 50454011
TargetEpidermal growth factor receptor(Homo sapiens (Human))
University Of Paris
Curated by ChEMBL
LigandPNGBDBM50454011(CHEMBL359136)
Affinity DataIC50: >5.00E+3nM. Assay description: In vitro inhibition of EGF-stimulated DNA synthesis of ER 22 cells by following the incorporation of methyl-[3H]thymidine.
In DepthDetails ArticlePubMed