BDBM50454087 CHEMBL2112597
SMILES Nc1nc(N)c2ncn([C@@H]3CCC[C@H]3O)c2n1
InChI Key InChIKey=BCHSDZWYFZFOEU-PHDIDXHHSA-N
Data  2 KI
  Tab Delimited (TSV)   2D SDfile   Computed 3D by Vconf -m prep SDfile
Find this compound or compounds like it in BindingDB:
Activity Spreadsheet -- Enzyme Inhibition Constant Data from BindingDB
Found 2 hits for monomerid = 50454087
TargetAdenosine receptor A2a(Rattus norvegicus (rat))
National Institute Of Diabetes
Curated by ChEMBL
LigandPNGBDBM50454087(CHEMBL2112597)
Affinity DataKi:  2.08E+4nM. Assay description: Binding affinity to adenosine A2A receptor in rat striatal membranes by measuring displacement of specific [3H]-CGS- 21680 as radioligand
In DepthDetails ArticlePubMed
TargetAdenosine receptor A3(Rattus norvegicus)
National Institute Of Diabetes
Curated by ChEMBL
LigandPNGBDBM50454087(CHEMBL2112597)
Affinity DataKi:  1.99E+5nM. Assay description: Binding affinity determined by displacement of specific binding of [125I]N-(4-amino-3-iodophenethyl)-adenosine in membranes of CHO cells stably trans...
In DepthDetails ArticlePubMed