BDBM50454202 CHEMBL2369126
SMILES [#6]-[#6]-[#6@@H](-[#6])-[#6@@H](-[#7]-[#6](=O)-[#6]-[#7]-[#6](=O)-[#6@@H](-[#7])-[#6]-c1ccc(-[#8])cc1)-[#6](=O)-[#7]-[#6@@H](-[#6]-c1ccccc1)-[#6](=O)-[#7]-[#6@@H](-[#6]-[#6](-[#6])-[#6])-[#6](=O)-[#7]-[#6@@H](-[#6]-[#6]-[#6]\[#7]=[#6](/[#7])-[#7])-[#6](=O)-[#7]-[#6@@H](-[#6]-[#6]-[#6]\[#7]=[#6](\[#7])-[#7])-[#6](=O)-[#7]-[#6@@H](-[#6@@H](-[#6])-[#6]-[#6])-[#6](=O)-[#7]-[#6@@H](-[#6]-[#6]-[#6]\[#7]=[#6](\[#7])-[#7])-[#6](=O)-[#7]-1-[#6]-[#6]-[#6]-[#6@H]-1-[#6](=O)-[#7]-[#6@@H](-[#6]-[#6]-[#6]-[#6]-[#7])-[#6](-[#7])=O
InChI Key InChIKey=UHFZIARRBCSJFR-WSMUTZFSSA-N
Data  3 IC50
  Tab Delimited (TSV)   2D SDfile   Computed 3D by Vconf -m prep SDfile
Find this compound or compounds like it in BindingDB:
Activity Spreadsheet -- Enzyme Inhibition Constant Data from BindingDB
Found 3 hits for monomerid = 50454202
TargetMu-type opioid receptor(GUINEA PIG)
University Of Arizona
Curated by ChEMBL
LigandPNGBDBM50454202(CHEMBL2369126)
Affinity DataIC50:  1.03E+3nM. Assay description: Inhibition of binding [3H]-DAMGO at Opioid receptor mu 1 of guinea pig brain membrane (GPB) homogenates.
In DepthDetails ArticlePubMed
TargetDelta-type opioid receptor(MOUSE)
University Of Arizona
Curated by ChEMBL
LigandPNGBDBM50454202(CHEMBL2369126)
Affinity DataIC50:  1.40E+4nM. Assay description: Agonistic activity towards Opioid receptor delta 1 was determined by evaluating the inhibitory activity towards electrically stimulated mouse vas def...
In DepthDetails ArticlePubMed
TargetKappa-type opioid receptor(Cavia porcellus (domestic guinea pig))
University Of Arizona
Curated by ChEMBL
LigandPNGBDBM50454202(CHEMBL2369126)
Affinity DataIC50:  55nM. Assay description: Inhibition of binding [3H]U-69,539 at Opioid receptor kappa 1 of guinea pig brain membrane (GPB) homogenates.
In DepthDetails ArticlePubMed