BDBM50454332 CHEMBL4205089
SMILES FC(F)(F)c1ccccc1NC(=O)N1CCN(CC1)C(=O)c1cc(nc2ccccc12)-c1ccccc1
InChI Key InChIKey=DAVCOFDJAOIDDP-UHFFFAOYSA-N
Data  1 IC50
  Tab Delimited (TSV)   2D SDfile   Computed 3D by Vconf -m prep SDfile
Find this compound or compounds like it in BindingDB:
Activity Spreadsheet -- Enzyme Inhibition Constant Data from BindingDB
Found 1 hit for monomerid = 50454332
TargetTransient receptor potential cation channel subfamily V member 1(Homo sapiens (Human))
China Pharmaceutical University
Curated by ChEMBL
LigandPNGBDBM50454332(CHEMBL4205089)
Affinity DataIC50:  47nM. Assay description: Antagonist activity at human TRPV1 assessed as inhibition of capsaicin-induced intracellular calcium level preincubated for 2.5 mins followed by caps...
Ligand InfoPC cidPC sid
In DepthDetails ArticlePubMed