BDBM50454426 CHEMBL2304158
SMILES CCNC(=O)[C@H]1O[C@H]([C@H](O)[C@@H]1O)n1cnc2c(N)nc(\C=C\CCCc3ccccc3)nc12
InChI Key InChIKey=WFGDXVZGFMAXNH-VMHVOBJKSA-N
Data  2 KI  2 EC50
  Tab Delimited (TSV)   2D SDfile   Computed 3D by Vconf -m prep SDfile
Find this compound or compounds like it in BindingDB:
Activity Spreadsheet -- Enzyme Inhibition Constant Data from BindingDB
Found 4 hits for monomerid = 50454426
TargetAdenosine receptor A2a(Rattus norvegicus (rat))
Universit£
Curated by ChEMBL
LigandPNGBDBM50454426(CHEMBL2304158)
Affinity DataKi:  3.5nM. Assay description: Displacement of [3H]-CGS- 51680 from Adenosine A2A receptor of rat striatum.
In DepthDetails ArticlePubMed
TargetAdenosine receptor A1(Rattus norvegicus (rat))
Universit£
Curated by ChEMBL
LigandPNGBDBM50454426(CHEMBL2304158)
Affinity DataKi:  1.02E+3nM. Assay description: Displacement of [3H]CHA from Adenosine A1 receptor of rat brain
In DepthDetails ArticlePubMed
TargetAdenosine receptor A1(Rattus norvegicus (rat))
Universit£
Curated by ChEMBL
LigandPNGBDBM50454426(CHEMBL2304158)
Affinity DataEC50: >1nM. Assay description: Adenosine A1 receptor mediated negative chronotropic activity in spontaneously beating rat atria
In DepthDetails ArticlePubMed
TargetAdenosine receptor A2a(Rattus norvegicus (rat))
Universit£
Curated by ChEMBL
LigandPNGBDBM50454426(CHEMBL2304158)
Affinity DataEC50:  576nM. Assay description: Vasorelaxation as Adenosine A2A receptor activity in rat aorta
In DepthDetails ArticlePubMed