BDBM50454533 CHEMBL4210773
SMILES OC(=O)c1ccc(CN2[C@@H](Cc3ccccn3)C(=O)Nc3cc(Cl)ccc3C2=O)cc1
InChI Key InChIKey=JSFGGWBJZGWYEV-FQEVSTJZSA-N
Data  1 IC50
  Tab Delimited (TSV)   2D SDfile   Computed 3D by Vconf -m prep SDfile
Find this compound or compounds like it in BindingDB:
Activity Spreadsheet -- Enzyme Inhibition Constant Data from BindingDB
Found 1 hit for monomerid = 50454533
TargetToxin B(Peptoclostridium difficile)
Genesis Biotechnology Group
Curated by ChEMBL
LigandPNGBDBM50454533(CHEMBL4210773)
Affinity DataIC50:  500nM. Assay description: Inhibition of C-terminal 6-His tagged recombinant Clostridium difficile toxin B catalytic fragment (Met1 to Leu543 residues) assessed as reduction in...
Ligand InfoPC cidPC sid
In DepthDetails ArticlePubMed