BDBM50454609 CHEMBL2112305
SMILES [H][C@@]12CCC([C@H]([C@H](C1)OC(=O)c1cccc(O)c1)C(=O)OC)N2C
InChI Key InChIKey=IQXBUEUAOWARGT-HYIGYNPQSA-N
Data  1 IC50
  Tab Delimited (TSV)   2D SDfile   Computed 3D by Vconf -m prep SDfile
Find this compound or compounds like it in BindingDB:
Activity Spreadsheet -- Enzyme Inhibition Constant Data from BindingDB
Found 1 hit for monomerid = 50454609
TargetSodium-dependent dopamine transporter(Rattus norvegicus (rat))
University Of Oklahoma
Curated by ChEMBL
LigandPNGBDBM50454609(CHEMBL2112305)
Affinity DataIC50:  1.18E+3nM. Assay description: Compound was tested for inhibitory activity to displace [3H]WIN-35428 at dopamine transporter in Rat Striatal Membranes.
In DepthDetails ArticlePubMed