BDBM50454693 CHEMBL131427
SMILES OC[C@H]1OC(Oc2cn(C3OC(CO)C(O)C(O)C3O)c3ccccc23)[C@H](O)[C@@H](O)[C@@H]1O
InChI Key InChIKey=BSPSZTQVFVDHEB-BVOCAALHSA-N
Data  1 KI
  Tab Delimited (TSV)   2D SDfile   Computed 3D by Vconf -m prep SDfile
Find this compound or compounds like it in BindingDB:
Activity Spreadsheet -- Enzyme Inhibition Constant Data from BindingDB
Found 1 hit for monomerid = 50454693
TargetGlycogen phosphorylase, muscle form(Homo sapiens (Human))
University Of Alcala
Curated by ChEMBL
LigandPNGBDBM50454693(CHEMBL131427)
Affinity DataKi:  2.57E+6nM. Assay description: Inhibitory activity against rabbit muscle glycogen phosphorylaseChecked by Author
In DepthDetails ArticlePubMed