BDBM50454771 CHEMBL4207782
SMILES COc1cc(NC(=S)NCCCn2cncc2C)ccc1OCCCC(N)=O
InChI Key InChIKey=RYCHRJISOYAGJI-UHFFFAOYSA-N
Data  1 IC50
  Tab Delimited (TSV)   2D SDfile   Computed 3D by Vconf -m prep SDfile
Find this compound or compounds like it in BindingDB:
Activity Spreadsheet -- Enzyme Inhibition Constant Data from BindingDB
Found 1 hit for monomerid = 50454771
TargetGlutaminyl-peptide cyclotransferase(Homo sapiens (Human))
Seoul National University
Curated by ChEMBL
LigandPNGBDBM50454771(CHEMBL4207782)
Affinity DataIC50:  54nM. Assay description: Inhibition of human glutaminyl cyclase using Gln-AMC as substrate by pGAPase coupled fluorescence assay
Ligand InfoPC cidPC sid
In DepthDetails ArticlePubMed