BDBM50454824 CHEMBL3084909
SMILES [H][C@]12CC[C@]([H])(C[C@@H](C1)OC(c1cccc(F)c1)c1cccc(F)c1)N2C
InChI Key InChIKey=REWRBJXOTYIRQA-PMOLBWCYSA-N
Data  3 KI  1 IC50
  Tab Delimited (TSV)   2D SDfile   Computed 3D by Vconf -m prep SDfile
Find this compound or compounds like it in BindingDB:
Activity Spreadsheet -- Enzyme Inhibition Constant Data from BindingDB
Found 4 hits for monomerid = 50454824
TargetMuscarinic acetylcholine receptor M1(RAT)
National Institutes Of Health
Curated by ChEMBL
LigandPNGBDBM50454824(CHEMBL3084909)
Affinity DataKi:  0.850nM. Assay description: Displacement of [3H]pirenzepine binding at muscarinic Muscarinic acetylcholine receptor M1 in rat brain P2 membranes.
In DepthDetails ArticlePubMed
TargetSodium-dependent dopamine transporter(Rattus norvegicus (rat))
National Institutes Of Health
Curated by ChEMBL
LigandPNGBDBM50454824(CHEMBL3084909)
Affinity DataKi:  47nM. Assay description: Displacement of [3H]WIN-35428 binding to the dopamine transporter (DAT) in Rat Caudate Putamen
In DepthDetails ArticlePubMed
TargetSodium-dependent dopamine transporter(Rattus norvegicus (rat))
National Institutes Of Health
Curated by ChEMBL
LigandPNGBDBM50454824(CHEMBL3084909)
Affinity DataKi:  48nM. Assay description: Binding affinity to dopamine transporter (DAT) using [3H]WIN-35428 as a radioligand
In DepthDetails ArticlePubMed
TargetSodium-dependent dopamine transporter(Rattus norvegicus (rat))
National Institutes Of Health
Curated by ChEMBL
LigandPNGBDBM50454824(CHEMBL3084909)
Affinity DataIC50:  407nM. Assay description: [3H]-Dopamine uptake inhibition in rat caudate putamen
In DepthDetails ArticlePubMed