BDBM50454938 CHEMBL2052017::L-363377
SMILES [H][C@@]12CCCN1C(=O)[C@H](Cc1ccc(O)cc1)NC(=O)[C@@H](Cc1c[nH]c3ccccc13)NC(=O)[C@H](CCCCN)NC(=O)[C@@]([H])(NC(=O)[C@H](Cc1ccccc1)NC2=O)[C@@H](C)O
InChI Key InChIKey=JVHHRGNQHDEURZ-RXYCCRQDSA-N
Data  1 KI
  Tab Delimited (TSV)   2D SDfile   Computed 3D by Vconf -m prep SDfile
Find this compound or compounds like it in BindingDB:
Activity Spreadsheet -- Enzyme Inhibition Constant Data from BindingDB
Found 1 hit for monomerid = 50454938
TargetSomatostatin receptor type 2(Homo sapiens (Human))
Merck Research Laboratories
Curated by ChEMBL
LigandPNGBDBM50454938(CHEMBL2052017 | L-363377)
Affinity DataKi:  0.5nM. Assay description: Binding affinity towards human sst2 receptor expressed in CHO-K1 cells
In DepthDetails ArticlePubMed