BDBM50455096 CHEMBL2092927
SMILES COc1ccccc1N1CCN(C[C@@H]2CN=C3N2C(SC)=Nc2ccccc32)CC1
InChI Key InChIKey=DVYBIZHLZSDANU-KRWDZBQOSA-N
Data  3 KI
  Tab Delimited (TSV)   2D SDfile   Computed 3D by Vconf -m prep SDfile
Find this compound or compounds like it in BindingDB:
Activity Spreadsheet -- Enzyme Inhibition Constant Data from BindingDB
Found 3 hits for monomerid = 50455096
TargetAlpha-1A adrenergic receptor(Rattus norvegicus (Rat))
National Taiwan University
Curated by ChEMBL
LigandPNGBDBM50455096(CHEMBL2092927)
Affinity DataKi:  122nM. Assay description: Displacement of [3H]prazosin from Alpha-1A adrenergic receptorof rat submaxillary gland membranes
In DepthDetails ArticlePubMed
TargetAlpha-1B adrenergic receptor(Rattus norvegicus (rat))
National Taiwan University
Curated by ChEMBL
LigandPNGBDBM50455096(CHEMBL2092927)
Affinity DataKi:  667nM. Assay description: Displacement of [3H]prazosin from Alpha-1B adrenergic receptor of rat liver membrane
In DepthDetails ArticlePubMed
TargetAlpha-2A adrenergic receptor(Homo sapiens (Human))
National Taiwan University
Curated by ChEMBL
LigandPNGBDBM50455096(CHEMBL2092927)
Affinity DataKi:  3.00E+3nM. Assay description: Compound is evaluated for binding affinity towards Alpha-2A adrenergic receptor using [3H]prazosin
In DepthDetails ArticlePubMed