BDBM50455098 CHEMBL2092926
SMILES COc1ccccc1N1CCN(C[C@@H]2CN=C3N2C(=O)Nc2ccccc32)CC1
InChI Key InChIKey=FUCGAUZSWYLMRK-INIZCTEOSA-N
Data  3 KI
  Tab Delimited (TSV)   2D SDfile   Computed 3D by Vconf -m prep SDfile
Find this compound or compounds like it in BindingDB:
Activity Spreadsheet -- Enzyme Inhibition Constant Data from BindingDB
Found 3 hits for monomerid = 50455098
TargetAlpha-1A adrenergic receptor(Rattus norvegicus (Rat))
National Taiwan University
Curated by ChEMBL
LigandPNGBDBM50455098(CHEMBL2092926)
Affinity DataKi:  55nM. Assay description: Displacement of [3H]prazosin from Alpha-1A adrenergic receptorof rat submaxillary gland membranes
In DepthDetails ArticlePubMed
TargetAlpha-1B adrenergic receptor(Rattus norvegicus (rat))
National Taiwan University
Curated by ChEMBL
LigandPNGBDBM50455098(CHEMBL2092926)
Affinity DataKi:  123nM. Assay description: Displacement of [3H]prazosin from Alpha-1B adrenergic receptor of rat liver membrane
In DepthDetails ArticlePubMed
TargetAlpha-2B adrenergic receptor(Homo sapiens (Human))
National Taiwan University
Curated by ChEMBL
LigandPNGBDBM50455098(CHEMBL2092926)
Affinity DataKi:  9.30E+3nM. Assay description: Compound is evaluated for binding affinity towards Alpha-2B adrenergic receptor using [3H]prazosin
In DepthDetails ArticlePubMed