BDBM50455206 CHEMBL2311086
SMILES [H][C@@]1(C[C@@H]1C(O)=O)[C@](N)(CC(c1ccccc1)c1ccccc1)C(O)=O
InChI Key InChIKey=QSTDCUJNEBAZGO-RIFZZMRRSA-N
Data  2 IC50
  Tab Delimited (TSV)   2D SDfile   Computed 3D by Vconf -m prep SDfile
Find this compound or compounds like it in BindingDB:
Activity Spreadsheet -- Enzyme Inhibition Constant Data from BindingDB
Found 2 hits for monomerid = 50455206
TargetMetabotropic glutamate receptor 2(Homo sapiens (Human))
Eli Lilly
Curated by ChEMBL
LigandPNGBDBM50455206(CHEMBL2311086)
Affinity DataIC50:  4.36E+3nM. Assay description: Ability to block 1S,3R-ACPD-induced inhibition of forskolin stimulated cyclic-AMP in non-neuronal cell line expressing human Metabotropic glutamate r...
In DepthDetails ArticlePubMed
TargetMetabotropic glutamate receptor 3(Homo sapiens (Human))
Eli Lilly
Curated by ChEMBL
LigandPNGBDBM50455206(CHEMBL2311086)
Affinity DataIC50:  280nM. Assay description: Ability to block 1S,3R-ACPD-induced inhibition of forskolin stimulated cyclic-AMP in non-neuronal cell line expressing human Metabotropic glutamate r...
In DepthDetails ArticlePubMed