BDBM50455443 CHEMBL2112944
SMILES [H][C@@]12CCC([C@H]([C@@H](C1)c1ccc(cc1)-c1ccccc1)C(=O)OC)N2C
InChI Key InChIKey=HGNMYGRBKGXPFK-NZKBUGBHSA-N
Data  2 IC50
  Tab Delimited (TSV)   2D SDfile   Computed 3D by Vconf -m prep SDfile
Find this compound or compounds like it in BindingDB:
Activity Spreadsheet -- Enzyme Inhibition Constant Data from BindingDB
Found 2 hits for monomerid = 50455443
TargetSodium-dependent dopamine transporter(Rattus norvegicus (rat))
University Of Maryland
Curated by ChEMBL
LigandPNGBDBM50455443(CHEMBL2112944)
Affinity DataIC50:  10nM. Assay description: Inhibition [3H]-cocaine binding to Cocaine receptor in rat striatal membranes.
In DepthDetails ArticlePubMed
TargetSodium-dependent dopamine transporter(Rattus norvegicus (rat))
University Of Maryland
Curated by ChEMBL
LigandPNGBDBM50455443(CHEMBL2112944)
Affinity DataIC50:  29nM. Assay description: Inhibition [3H]DA uptake in rat striatal synaptosomes.
In DepthDetails ArticlePubMed