BDBM50455504 CHEMBL4206054
SMILES CC(=O)N1C(CN(Cc2ccccc2O)c2ccccc12)C1CC1
InChI Key InChIKey=WMZULNMVYKYGTR-UHFFFAOYSA-N
Data  2 IC50
  Tab Delimited (TSV)   2D SDfile   Computed 3D by Vconf -m prep SDfile
Find this compound or compounds like it in BindingDB:
Activity Spreadsheet -- Enzyme Inhibition Constant Data from BindingDB
Found 2 hits for monomerid = 50455504
TargetBromodomain-containing protein 4(Homo sapiens (Human))
University Of Strathclyde
Curated by ChEMBL
LigandPNGBDBM50455504(CHEMBL4206054)
Affinity DataIC50:  501nM. Assay description: Displacement of (+)-JQ1 from 6H-Thr BRD4 Y97A mutant BD2 (unknown origin) after 30 mins by TR-FRET assay
Ligand InfoPC cidPC sid
In DepthDetails ArticlePubMed
TargetBromodomain-containing protein 4(Homo sapiens (Human))
University Of Strathclyde
Curated by ChEMBL
LigandPNGBDBM50455504(CHEMBL4206054)
Affinity DataIC50:  2.00E+4nM. Assay description: Displacement of (+)-JQ1 from 6H-Thr BRD4 Y390A mutant BD1 (unknown origin) after 30 mins by TR-FRET assay
Ligand InfoPC cidPC sid
In DepthDetails ArticlePubMed