BDBM50455598 CHEMBL2112335
SMILES C[C@@](Cc1c[nH]c2ccccc12)(NC(=O)OC1C2CC3CC(C2)CC1C3)C(=O)NC[C@@H](NC(=O)CCn1nn[nH]c1=S)c1ccccc1
InChI Key InChIKey=PRUDWFVDSIXFLP-PHIIHZIRSA-N
Data  2 IC50
  Tab Delimited (TSV)   2D SDfile   Computed 3D by Vconf -m prep SDfile
Find this compound or compounds like it in BindingDB:
Activity Spreadsheet -- Enzyme Inhibition Constant Data from BindingDB
Found 2 hits for monomerid = 50455598
TargetCholecystokinin receptor type A(RAT)
Parke-Davis Neuroscience Research Centre
Curated by ChEMBL
LigandPNGBDBM50455598(CHEMBL2112335)
Affinity DataIC50:  620nM. Assay description: Evaluated for inhibition of CCK-A receptor by displacing [125I]bolton hunter CCK-8 radioligand in the rat pancreas
In DepthDetails ArticlePubMed
TargetGastrin/cholecystokinin type B receptor(MOUSE)
Parke-Davis Neuroscience Research Centre
Curated by ChEMBL
LigandPNGBDBM50455598(CHEMBL2112335)
Affinity DataIC50:  2.40nM. Assay description: Evaluated for inhibition of CCK-B receptor by displacing [125I]bolton hunter CCK-8 radioligand in the mouse cerebral cortex
In DepthDetails ArticlePubMed