BDBM50455753 CHEMBL4209048
SMILES CCC(=O)NC1CCc2c(-c3ccc(Oc4ccccc4)cc3)c3c(N)ncnc3n2C1
InChI Key InChIKey=BWVFZYOLGYHOEC-UHFFFAOYSA-N
Data  1 IC50
  Tab Delimited (TSV)   2D SDfile   Computed 3D by Vconf -m prep SDfile
Find this compound or compounds like it in BindingDB:
Activity Spreadsheet -- Enzyme Inhibition Constant Data from BindingDB
Found 1 hit for monomerid = 50455753
TargetTyrosine-protein kinase BTK(Homo sapiens (Human))
China Pharmaceutical University
Curated by ChEMBL
LigandPNGBDBM50455753(CHEMBL4209048)
Affinity DataIC50:  417nM. Assay description: Inhibition of recombinant human BTK using Poly(Glu, Tyr) 4:1 as substrate after 1 hr by ELISA
Ligand InfoPC cidPC sid
In DepthDetails ArticlePubMed