BDBM50455771 CHEMBL2113576
SMILES [Na+].OC[C@H]1O[C@H]([C@H](O)[C@@H]1O)n1cnc2c(NCCCc3ccc(cc3)S([O-])(=O)=O)ncnc12
InChI Key InChIKey=YIYUNVYOOUQZRP-ZPXBPYQOSA-M
Data  3 KI
  Tab Delimited (TSV)   2D SDfile   Computed 3D by Vconf -m prep SDfile
Find this compound or compounds like it in BindingDB:
Activity Spreadsheet -- Enzyme Inhibition Constant Data from BindingDB
Found 3 hits for monomerid = 50455771
TargetAdenosine receptor A1(Rattus norvegicus (rat))
National Institute Of Diabetes
Curated by ChEMBL
LigandPNGBDBM50455771(CHEMBL2113576)
Affinity DataKi:  610nM. Assay description: Affinity for adenosine A1 receptor at rat cortical receptors using 1 nM [3H]PIA
In DepthDetails ArticlePubMed
TargetAdenosine receptor A1(Rattus norvegicus (rat))
National Institute Of Diabetes
Curated by ChEMBL
LigandPNGBDBM50455771(CHEMBL2113576)
Affinity DataKi:  610nM. Assay description: Inhibition of [3H]PIA binding to rat cortical adenosine A1 receptor
In DepthDetails ArticlePubMed
TargetAdenosine receptor A2a/A2b(Rattus norvegicus)
National Institute Of Diabetes
Curated by ChEMBL
LigandPNGBDBM50455771(CHEMBL2113576)
Affinity DataKi:  3.84E+3nM. Assay description: Affinity for adenosine A2 receptor at rat striatal membrane using 5 nM [3H]CGS-21680
In DepthDetails ArticlePubMed