BDBM50455928 CHEMBL267076
SMILES Cn1cc(C2=NCC3(CN4CCC3CC4)O2)c2cc(N)ccc12
InChI Key InChIKey=GDYCXIQSDLUQBN-UHFFFAOYSA-N
Data  1 IC50
  Tab Delimited (TSV)   2D SDfile   Computed 3D by Vconf -m prep SDfile
Find this compound or compounds like it in BindingDB:
Activity Spreadsheet -- Enzyme Inhibition Constant Data from BindingDB
Found 1 hit for monomerid = 50455928
Target5-hydroxytryptamine receptor 3A/3B(Rattus norvegicus)
Merck Sharp And Dohme Research Laboratories
Curated by ChEMBL
LigandPNGBDBM50455928(CHEMBL267076)
Affinity DataIC50:  575nM. Assay description: Displacement of [3H]Q-ICS-205-930 from 5-hydroxytryptamine 3 receptor recognition sites in rat brain membranes
In DepthDetails ArticlePubMed