BDBM50455929 CHEMBL266227
SMILES Cn1c(c(C2=NCC3(CN4CCC3CC4)O2)c2ccccc12)[Si](C)(C)C
InChI Key InChIKey=HEUINOGGWVVKAC-UHFFFAOYSA-N
Data  1 IC50
  Tab Delimited (TSV)   2D SDfile   Computed 3D by Vconf -m prep SDfile
Find this compound or compounds like it in BindingDB:
Activity Spreadsheet -- Enzyme Inhibition Constant Data from BindingDB
Found 1 hit for monomerid = 50455929
Target5-hydroxytryptamine receptor 3A/3B(Rattus norvegicus)
Merck Sharp And Dohme Research Laboratories
Curated by ChEMBL
LigandPNGBDBM50455929(CHEMBL266227)
Affinity DataIC50:  155nM. Assay description: Displacement of [3H]Q-ICS-205-930 from 5-hydroxytryptamine 3 receptor recognition sites in rat brain membranes
In DepthDetails ArticlePubMed