BDBM50456332 CHEMBL2371339
SMILES CN([C@@H](Cc1ccccc1)C(=O)N1CCC[C@H]1C(N)=O)C(=O)[C@@H]1CCCN1C(=O)[C@@H](N)Cc1ccc(O)cc1
InChI Key InChIKey=JAKBYSTWCHUQOK-QORCZRPOSA-N
Data  2 IC50
  Tab Delimited (TSV)   2D SDfile   Computed 3D by Vconf -m prep SDfile
Find this compound or compounds like it in BindingDB:
Activity Spreadsheet -- Enzyme Inhibition Constant Data from BindingDB
Found 2 hits for monomerid = 50456332
TargetMu-type opioid receptor(GUINEA PIG)
University Of California
Curated by ChEMBL
LigandPNGBDBM50456332(CHEMBL2371339)
Affinity DataIC50:  170nM. Assay description: In vitro inhibitory activity against mu opioid receptor using guinea pig ileum (GPI) assay
In DepthDetails ArticlePubMed
TargetDelta-type opioid receptor(MOUSE)
University Of California
Curated by ChEMBL
LigandPNGBDBM50456332(CHEMBL2371339)
Affinity DataIC50:  1.79E+3nM. Assay description: In vitro inhibitory activity against delta opioid receptor using mouse vas deferens (MVD) assay
In DepthDetails ArticlePubMed