BDBM50456793 CHEMBL4214656
SMILES [H][C@@]12CCc3cc(C(C)C)c(cc3[C@@]1(C)CCC[C@@]2(C)C(=O)N[C@H](Cc1ccccc1)C(=O)Nc1ccccc1Br)S(O)(=O)=O
InChI Key InChIKey=FPINEFQCAFQWQM-PEWUYPRLSA-N
Data  3 IC50
  Tab Delimited (TSV)   2D SDfile   Computed 3D by Vconf -m prep SDfile
Find this compound or compounds like it in BindingDB:
Activity Spreadsheet -- Enzyme Inhibition Constant Data from BindingDB
Found 3 hits for monomerid = 50456793
TargetStromelysin-1(Homo sapiens (Human))
Southeast University
Curated by ChEMBL
LigandPNGBDBM50456793(CHEMBL4214656)
Affinity DataIC50: >1.00E+5nM. Assay description: Inhibition of recombinant human MMP3 (Tyr18 to Cys477 residues) expressed in mouse myeloma cells using Mca-Pro-LeuGly-Leu-Dpa-Ala-Arg-NH2 as substrat...
Ligand InfoPC cidPC sid
In DepthDetails ArticlePubMed
TargetMatrix metalloproteinase-9(Homo sapiens (Human))
Southeast University
Curated by ChEMBL
LigandPNGBDBM50456793(CHEMBL4214656)
Affinity DataIC50: >1.00E+5nM. Assay description: Inhibition of recombinant human MMP9 (Ala20 to Asp707 residues) expressed in CHO cells using Mca-Pro-LeuGly-Leu-Dpa-Ala-Arg-NH2 as substrate preincub...
Ligand InfoPC cidPC sid
In DepthDetails ArticlePubMed
TargetNeutrophil collagenase(Homo sapiens (Human))
Southeast University
Curated by ChEMBL
LigandPNGBDBM50456793(CHEMBL4214656)
Affinity DataIC50: >1.00E+5nM. Assay description: Inhibition of recombinant human MMP8 (Phe21 to Gly467 residues) expressed in mouse myeloma cells using Mca-Pro-LeuGly-Leu-Dpa-Ala-Arg-NH2 as substrat...
Ligand InfoPC cidPC sid
In DepthDetails ArticlePubMed