BDBM50458274 CHEMBL4206049
SMILES CC1=CC(=O)C(=O)c2c3CCCCc3ccc12
InChI Key InChIKey=HLVLHKHCAQKXEK-UHFFFAOYSA-N
Data  1 KI
  Tab Delimited (TSV)   2D SDfile   Computed 3D by Vconf -m prep SDfile
Find this compound or compounds like it in BindingDB:
Activity Spreadsheet -- Enzyme Inhibition Constant Data from BindingDB
Found 1 hit for monomerid = 50458274
TargetLiver carboxylesterase 1(Homo sapiens (Human))
St. Jude Children'S Research Hospital
Curated by ChEMBL
LigandPNGBDBM50458274(CHEMBL4206049)
Affinity DataKi:  25nM. Assay description: Inhibition of human liver carboxylesterase 1 using o-nitrophenyl acetate as substrate
In DepthDetails ArticlePubMed