BDBM50459627 CHEMBL4208779
SMILES CCOC(=O)[C@@H]1CN(CCn2c(=O)[nH]c3ccccc3c2=O)CC[C@@H]1c1cccc(c1)C(F)(F)F
InChI Key InChIKey=SMJPJSDEOFDSNC-UYAOXDASSA-N
Data  5 KI  2 IC50
  Tab Delimited (TSV)   2D SDfile   Computed 3D by Vconf -m prep SDfile
Find this compound or compounds like it in BindingDB:
Activity Spreadsheet -- Enzyme Inhibition Constant Data from BindingDB
Found 7 hits for monomerid = 50459627
TargetSynaptic vesicular amine transporter(Homo sapiens (Human))
Organix
Curated by ChEMBL
LigandPNGBDBM50459627(CHEMBL4208779)
Affinity DataKi:  350nM. Assay description: Displacement of [3H](+)-syn-Ethyl 1-(2-(2,4-Dioxo-1,2-dihydroquinazolin-3(4H)-yl)ethyl)-4-(4-fluorophenyl)piperidine-3-carboxylate from human VMAT2 e...
Ligand InfoPC cidPC sid
In DepthDetails ArticlePubMed
TargetSynaptic vesicular amine transporter(Homo sapiens (Human))
Organix
Curated by ChEMBL
LigandPNGBDBM50459627(CHEMBL4208779)
Affinity DataKi:  990nM. Assay description: Displacement of [3H]reserpine from human VMAT2 expressed in HEK293 cell membranes incubated for 60 mins by scintillation counting method
Ligand InfoPC cidPC sid
In DepthDetails ArticlePubMed
TargetSynaptic vesicular amine transporter(Homo sapiens (Human))
Organix
Curated by ChEMBL
LigandPNGBDBM50459627(CHEMBL4208779)
Affinity DataKi: >1.00E+4nM. Assay description: Displacement of [3H]DHTB from human VMAT2 expressed in HEK293 cell membranes incubated for 90 mins by microbeta scintillation counting method
Ligand InfoPC cidPC sid
In DepthDetails ArticlePubMed
Target5-hydroxytryptamine receptor 2A(Homo sapiens (Human))
Organix
Curated by ChEMBL
LigandPNGBDBM50459627(CHEMBL4208779)
Affinity DataKi: >1.00E+4nM. Assay description: Displacement of [125I]DOI from human 5HT2A receptor expressed in HEK293 cell membranes
Ligand InfoPC cidPC sid
In DepthDetails ArticlePubMed
TargetSodium-dependent dopamine transporter(Homo sapiens (Human))
Organix
Curated by ChEMBL
LigandPNGBDBM50459627(CHEMBL4208779)
Affinity DataKi: >1.00E+4nM. Assay description: Displacement of [125I]RTI-55 from human DAT expressed in HEK293 cell membranes
Ligand InfoPC cidPC sid
In DepthDetails ArticlePubMed
TargetSynaptic vesicular amine transporter(Homo sapiens (Human))
Organix
Curated by ChEMBL
LigandPNGBDBM50459627(CHEMBL4208779)
Affinity DataIC50:  125nM. Assay description: Inhibition of human VMAT2 expressed in HEK293 cell membranes assessed as reduction in [3H[-5HT uptake pre-incubated for 10 mins before [3H[-5HT addit...
Ligand InfoPC cidPC sid
In DepthDetails ArticlePubMed
TargetSynaptic vesicular amine transporter(Mus musculus)
Organix
Curated by ChEMBL
LigandPNGBDBM50459627(CHEMBL4208779)
Affinity DataIC50:  13nM. Assay description: Inhibition of VMAT2 in C57Bl/6J mouse striatal membranes assessed as reduction in [3H[-5HT uptake pre-incubated for 10 mins before [3H[-5HT addition ...
Ligand InfoPC cidPC sid
In DepthDetails ArticlePubMed