BDBM50459646 CHEMBL4211832
SMILES O=C(N1CCN(CC1)C1CN(C(=O)C1)c1cccc(c1)-c1ccccc1)c1nccs1
InChI Key InChIKey=ZWUZRKUHKKIXKI-UHFFFAOYSA-N
Data  1 IC50
  Tab Delimited (TSV)   2D SDfile   Computed 3D by Vconf -m prep SDfile
Find this compound or compounds like it in BindingDB:
Activity Spreadsheet -- Enzyme Inhibition Constant Data from BindingDB
Found 1 hit for monomerid = 50459646
TargetMonoglyceride lipase(Homo sapiens (Human))
Takeda Pharmaceutical
Curated by ChEMBL
LigandPNGBDBM50459646(CHEMBL4211832)
Affinity DataIC50:  8.90nM. Assay description: Inhibition of His-tagged human MAGL expressed in Escherichia coli BL21(DE3) assessed as reduction in arachidonic acid production from 2-arachidonoylg...
Ligand InfoPC cidPC sid
In DepthDetails ArticlePubMed