BDBM50459859 CHEMBL4228617
SMILES OC(=O)\C=C\C=C\c1ccc(cc1)C1=C(CCOc2cc(F)ccc12)c1ccc(O)cc1
InChI Key InChIKey=LKTOPEFGKFLADU-ZPUQHVIOSA-N
Data  2 IC50
  Tab Delimited (TSV)   2D SDfile   Computed 3D by Vconf -m prep SDfile
Find this compound or compounds like it in BindingDB:
Activity Spreadsheet -- Enzyme Inhibition Constant Data from BindingDB
Found 2 hits for monomerid = 50459859
TargetEstrogen receptor(Homo sapiens (Human))
Trinity College
Curated by ChEMBL
LigandPNGBDBM50459859(CHEMBL4228617)
Affinity DataIC50:  72nM. Assay description: Displacement of fluorescein-labeled estradiol (fluoromone) from human recombinant full-length estrogen receptor alpha after 2 hrs by fluorescence pol...
Ligand InfoPC cidPC sid
In DepthDetails ArticlePubMed
TargetEstrogen receptor beta(Homo sapiens (Human))
Trinity College
Curated by ChEMBL
LigandPNGBDBM50459859(CHEMBL4228617)
Affinity DataIC50:  0.550nM. Assay description: Displacement of fluorescein-labeled estradiol (fluoromone) from human recombinant full-length estrogen receptor beta after 2 hrs by fluorescence pola...
Ligand InfoPC cidPC sid
In DepthDetails ArticlePubMed