BDBM50460773 CHEMBL4227082
SMILES Cc1cn2c(cnc2c(Nc2cc(Cc3ccccn3)ns2)n1)-c1cn[nH]c1
InChI Key InChIKey=NNQHKTWARZSGTQ-UHFFFAOYSA-N
Data  28 IC50  2 Kd  1 EC50
  Tab Delimited (TSV)   2D SDfile   Computed 3D by Vconf -m prep SDfile
Find this compound or compounds like it in BindingDB:
Activity Spreadsheet -- Enzyme Inhibition Constant Data from BindingDB
Found 31 hits for monomerid = 50460773
TargetInhibitor of nuclear factor kappa-B kinase subunit beta(Homo sapiens (Human))
Merck
Curated by ChEMBL
LigandPNGBDBM50460773(CHEMBL4227082)
Affinity DataIC50: >500nM. Assay description: Inhibition of IKKB (unknown origin)
Ligand InfoPC cidPC sid
In DepthDetails ArticlePubMed
TargetGlycogen synthase kinase-3 beta(Homo sapiens (Human))
Merck
Curated by ChEMBL
LigandPNGBDBM50460773(CHEMBL4227082)
Affinity DataIC50: >500nM. Assay description: Inhibition of GSK3b (unknown origin)
Ligand InfoPC cidPC sid
In DepthDetails ArticlePubMed
TargetTyrosine-protein kinase JAK2(Homo sapiens (Human))
Merck
Curated by ChEMBL
LigandPNGBDBM50460773(CHEMBL4227082)
Affinity DataIC50: >500nM. Assay description: Inhibition of JAK2 (unknown origin)
Ligand InfoPC cidPC sid
In DepthDetails ArticlePubMed
TargetAurora kinase A(Homo sapiens (Human))
Merck
Curated by ChEMBL
LigandPNGBDBM50460773(CHEMBL4227082)
Affinity DataIC50: <4nM. Assay description: Inhibition of Aurora A (unknown origin) using Tamra-PKAtide as substrate by fluorescence polarization assay
Ligand InfoPC cidPC sid
In DepthDetails ArticlePubMed
TargetAurora kinase A(Homo sapiens (Human))
Merck
Curated by ChEMBL
LigandPNGBDBM50460773(CHEMBL4227082)
Affinity DataKd:  0.0100nM. Assay description: Binding affinity to Aurora A (unknown origin) after 45 mins by fluorescence-based thermal stability shift assay
Ligand InfoPC cidPC sid
In DepthDetails ArticlePubMed
TargetAurora kinase B(Homo sapiens (Human))
Merck
Curated by ChEMBL
LigandPNGBDBM50460773(CHEMBL4227082)
Affinity DataKd:  0.100nM. Assay description: Binding affinity to Aurora B (unknown origin) after 45 mins by fluorescence-based thermal stability shift assay
Ligand InfoPC cidPC sid
In DepthDetails ArticlePubMed
TargetTyrosine-protein kinase Lck(Homo sapiens (Human))
Merck
Curated by ChEMBL
LigandPNGBDBM50460773(CHEMBL4227082)
Affinity DataIC50:  271nM. Assay description: Inhibition of LCK (unknown origin)
Ligand InfoPC cidPC sid
In DepthDetails ArticlePubMed
TargetRAC-alpha serine/threonine-protein kinase(Homo sapiens (Human))
Merck
Curated by ChEMBL
LigandPNGBDBM50460773(CHEMBL4227082)
Affinity DataIC50: >500nM. Assay description: Inhibition of AKT1 (unknown origin)
Ligand InfoPC cidPC sid
In DepthDetails ArticlePubMed
TargetCalcium/calmodulin-dependent protein kinase type IV(Homo sapiens (Human))
Merck
Curated by ChEMBL
LigandPNGBDBM50460773(CHEMBL4227082)
Affinity DataIC50: >500nM. Assay description: Inhibition of CAMK4 (unknown origin)
Ligand InfoPC cidPC sid
In DepthDetails ArticlePubMed
TargetCyclin-dependent kinase 2(Homo sapiens (Human))
Merck
Curated by ChEMBL
LigandPNGBDBM50460773(CHEMBL4227082)
Affinity DataIC50: >500nM. Assay description: Inhibition of CDK2 (unknown origin)
Ligand InfoPC cidPC sid
In DepthDetails ArticlePubMed
TargetCasein kinase I isoform delta(Homo sapiens (Human))
Merck
Curated by ChEMBL
LigandPNGBDBM50460773(CHEMBL4227082)
Affinity DataIC50: >500nM. Assay description: Inhibition of CSNK1D (unknown origin)
Ligand InfoPC cidPC sid
In DepthDetails ArticlePubMed
TargetMitogen-activated protein kinase 1(Homo sapiens (Human))
Merck
Curated by ChEMBL
LigandPNGBDBM50460773(CHEMBL4227082)
Affinity DataIC50: >500nM. Assay description: Inhibition of ERK2 (unknown origin)
Ligand InfoPC cidPC sid
In DepthDetails ArticlePubMed
TargetInsulin-like growth factor 1 receptor(Homo sapiens (Human))
Merck
Curated by ChEMBL
LigandPNGBDBM50460773(CHEMBL4227082)
Affinity DataIC50: >500nM. Assay description: Inhibition of IGF1R (unknown origin)
Ligand InfoPC cidPC sid
In DepthDetails ArticlePubMed
TargetHepatocyte growth factor receptor(Homo sapiens (Human))
Merck
Curated by ChEMBL
LigandPNGBDBM50460773(CHEMBL4227082)
Affinity DataIC50: >500nM. Assay description: Inhibition of MET (unknown origin)
Ligand InfoPC cidPC sid
In DepthDetails ArticlePubMed
TargetSerine/threonine-protein kinase 3(Homo sapiens (Human))
Merck
Curated by ChEMBL
LigandPNGBDBM50460773(CHEMBL4227082)
Affinity DataIC50: >500nM. Assay description: Inhibition of MST2 (unknown origin)
Ligand InfoPC cidPC sid
In DepthDetails ArticlePubMed
TargetProtein kinase C alpha type(Homo sapiens (Human))
Merck
Curated by ChEMBL
LigandPNGBDBM50460773(CHEMBL4227082)
Affinity DataIC50: >500nM. Assay description: Inhibition of PKCA (unknown origin)
Ligand InfoPC cidPC sid
In DepthDetails ArticlePubMed
TargetRho-associated protein kinase 2(Homo sapiens (Human))
Merck
Curated by ChEMBL
LigandPNGBDBM50460773(CHEMBL4227082)
Affinity DataIC50: >500nM. Assay description: Inhibition of ROCK2 (unknown origin)
Ligand InfoPC cidPC sid
In DepthDetails ArticlePubMed
TargetTestis-specific serine/threonine-protein kinase 2(Homo sapiens (Human))
Merck
Curated by ChEMBL
LigandPNGBDBM50460773(CHEMBL4227082)
Affinity DataIC50: >500nM. Assay description: Inhibition of TSSK2 (unknown origin)
Ligand InfoPC cidPC sid
In DepthDetails ArticlePubMed
TargetCytochrome P450 2C9(Homo sapiens (Human))
Merck
Curated by ChEMBL
LigandPNGBDBM50460773(CHEMBL4227082)
Affinity DataIC50: >2.00E+4nM. Assay description: Inhibition of CYP2C9 in human liver microsomes
Ligand InfoPC cidPC sid
In DepthDetails ArticlePubMed
TargetEphrin type-B receptor 4(Homo sapiens (Human))
Merck
Curated by ChEMBL
LigandPNGBDBM50460773(CHEMBL4227082)
Affinity DataIC50:  390nM. Assay description: Inhibition of EPHB4 (unknown origin)
Ligand InfoPC cidPC sid
In DepthDetails ArticlePubMed
TargetSerine/threonine-protein kinase Nek2(Homo sapiens (Human))
Merck
Curated by ChEMBL
LigandPNGBDBM50460773(CHEMBL4227082)
Affinity DataIC50: >500nM. Assay description: Inhibition of NEK2 (unknown origin)
Ligand InfoPC cidPC sid
In DepthDetails ArticlePubMed
TargetSerine/threonine-protein kinase PLK3(Homo sapiens (Human))
Merck
Curated by ChEMBL
LigandPNGBDBM50460773(CHEMBL4227082)
Affinity DataIC50: >500nM. Assay description: Inhibition of PLK3 (unknown origin)
Ligand InfoPC cidPC sid
In DepthDetails ArticlePubMed
TargetCytochrome P450 3A4(Homo sapiens (Human))
Merck
Curated by ChEMBL
LigandPNGBDBM50460773(CHEMBL4227082)
Affinity DataIC50: >2.00E+4nM. Assay description: Inhibition of CYP3A4 in human liver microsomes
Ligand InfoPC cidPC sid
In DepthDetails ArticlePubMed
TargetCytochrome P450 2C19(Homo sapiens (Human))
Merck
Curated by ChEMBL
LigandPNGBDBM50460773(CHEMBL4227082)
Affinity DataIC50: >20nM. Assay description: Inhibition of CYP2C19 in human liver microsomes
Ligand InfoPC cidPC sid
In DepthDetails ArticlePubMed
TargetAurora kinase B(Homo sapiens (Human))
Merck
Curated by ChEMBL
LigandPNGBDBM50460773(CHEMBL4227082)
Affinity DataEC50:  117nM. Assay description: Inhibition of Aurora B in human HCT116 cells assessed as reduction in phosphorylation of Histone H3 at Ser10 residue incubated for 1 hr by Hoechst 33...
Ligand InfoPC cidPC sid
In DepthDetails ArticlePubMed
TargetAurora kinase B(Homo sapiens (Human))
Merck
Curated by ChEMBL
LigandPNGBDBM50460773(CHEMBL4227082)
Affinity DataIC50: <13nM. Assay description: Inhibition of Aurora B (unknown origin) using Tamra-PKAtide as substrate by fluorescence polarization assay
Ligand InfoPC cidPC sid
In DepthDetails ArticlePubMed
TargetSerine/threonine-protein kinase Chk1(Homo sapiens (Human))
Merck
Curated by ChEMBL
LigandPNGBDBM50460773(CHEMBL4227082)
Affinity DataIC50:  360nM. Assay description: Inhibition of CHK1 (unknown origin)
Ligand InfoPC cidPC sid
In DepthDetails ArticlePubMed
TargetReceptor-type tyrosine-protein kinase FLT3(Homo sapiens (Human))
Merck
Curated by ChEMBL
LigandPNGBDBM50460773(CHEMBL4227082)
Affinity DataIC50:  14nM. Assay description: Inhibition of FLT3 (unknown origin)
Ligand InfoPC cidPC sid
In DepthDetails ArticlePubMed
TargetCytochrome P450 2D6(Homo sapiens (Human))
Merck
Curated by ChEMBL
LigandPNGBDBM50460773(CHEMBL4227082)
Affinity DataIC50: >2.00E+4nM. Assay description: Inhibition of CYP2D6 in human liver microsomes
Ligand InfoPC cidPC sid
In DepthDetails ArticlePubMed
TargetRibosomal protein S6 kinase alpha-3(Homo sapiens (Human))
Merck
Curated by ChEMBL
LigandPNGBDBM50460773(CHEMBL4227082)
Affinity DataIC50:  260nM. Assay description: Inhibition of RSK2 (unknown origin)
Ligand InfoPC cidPC sid
In DepthDetails ArticlePubMed
TargetEpidermal growth factor receptor(Homo sapiens (Human))
Merck
Curated by ChEMBL
LigandPNGBDBM50460773(CHEMBL4227082)
Affinity DataIC50: >500nM. Assay description: Inhibition of EGFR (unknown origin)
Ligand InfoPC cidPC sid
In DepthDetails ArticlePubMed