BDBM50461380 CHEMBL4225418
SMILES COc1ncc(cc1NS(C)(=O)=O)-c1cc(NC(=O)c2coc(CN3CCN(Cc4cccnc4)CC3)n2)c2cnn(C)c2n1
InChI Key InChIKey=BNAYKDZWTZCACN-UHFFFAOYSA-N
Data  1 IC50
  Tab Delimited (TSV)   2D SDfile   Computed 3D by Vconf -m prep SDfile
Find this compound or compounds like it in BindingDB:
Activity Spreadsheet -- Enzyme Inhibition Constant Data from BindingDB
Found 1 hit for monomerid = 50461380
LigandPNGBDBM50461380(CHEMBL4225418)
Affinity DataIC50:  0.75nM. Assay description: Inhibition of recombinant human full length N-terminal His6-tagged PI3K p110delta/untagged recombinant full length human p85alpha expressed in baculo...
Ligand InfoPC cidPC sid
In DepthDetails ArticlePubMed