BDBM50462277 CHEMBL4238084
SMILES CC(=O)NCc1cccc(OC[C@@H](O)CNCCc2ccc(NS(=O)(=O)c3ccccc3)cc2)c1
InChI Key InChIKey=AWIONHVPTYTSHZ-DEOSSOPVSA-N
Data  3 EC50
  Tab Delimited (TSV)   2D SDfile   Computed 3D by Vconf -m prep SDfile
Find this compound or compounds like it in BindingDB:
Activity Spreadsheet -- Enzyme Inhibition Constant Data from BindingDB
Found 3 hits for monomerid = 50462277
TargetBeta-3 adrenergic receptor(Homo sapiens (Human))
East China Normal University
Curated by ChEMBL
LigandPNGBDBM50462277(CHEMBL4238084)
Affinity DataEC50:  12nM. Assay description: Antagonist activity at human beta3 adrenergic receptor expressed in HEK293 cells co-expressing Galpha16 assessed as inhibition of isoproterenol-induc...
In DepthDetails ArticlePubMed
TargetBeta-2 adrenergic receptor(Homo sapiens (Human))
East China Normal University
Curated by ChEMBL
LigandPNGBDBM50462277(CHEMBL4238084)
Affinity DataEC50:  2.35E+4nM. Assay description: Antagonist activity at human beta2 adrenergic receptor expressed in HEK293 cells co-expressing Galpha16 assessed as inhibition of isoproterenol-induc...
In DepthDetails ArticlePubMed
TargetBeta-1 adrenergic receptor(Homo sapiens (Human))
East China Normal University
Curated by ChEMBL
LigandPNGBDBM50462277(CHEMBL4238084)
Affinity DataEC50:  889nM. Assay description: Antagonist activity at human beta1 adrenergic receptor expressed in HEK293 cells co-expressing Galpha16 assessed as inhibition of isoproterenol-induc...
In DepthDetails ArticlePubMed