BDBM50462711 CHEMBL4241204
SMILES CN1CCN(CCCOc2cccc(CC(=O)Nc3nc(cs3)-c3ccncc3)c2)CC1
InChI Key InChIKey=MISCDRJBXGYJGL-UHFFFAOYSA-N
Data  2 KI
  Tab Delimited (TSV)   2D SDfile   Computed 3D by Vconf -m prep SDfile
Find this compound or compounds like it in BindingDB:
Activity Spreadsheet -- Enzyme Inhibition Constant Data from BindingDB
Found 2 hits for monomerid = 50462711
TargetRho-associated protein kinase 1(Homo sapiens (Human))
Vertex Pharmaceuticals
Curated by ChEMBL
LigandPNGBDBM50462711(CHEMBL4241204)
Affinity DataKi:  45nM. Assay description: Inhibition of ROCK1 (6 to 553 residues) (unknown origin) using Lys-Lys-Arg-Asn-Arg-Thr-Leu-Ser-Val as substrate by pyruvate kinase-lactate dehydrogen...
Ligand InfoPC cidPC sid
In DepthDetails ArticlePubMed
TargetcAMP-dependent protein kinase catalytic subunit alpha(Homo sapiens (Human))
Vertex Pharmaceuticals
Curated by ChEMBL
LigandPNGBDBM50462711(CHEMBL4241204)
Affinity DataKi: >4.00E+3nM. Assay description: Inhibition of PKAalpha (1 to 351 residues) (unknown origin) using Leu-Arg-Arg-Ala-Ser-Leu-Gly as substrate by pyruvate kinase-lactate dehydrogenase c...
Ligand InfoPC cidPC sid
In DepthDetails ArticlePubMed