BDBM50462977 CHEMBL4247980
SMILES CC[C@H](C)[C@H](NC(=O)[C@H](CCCCN)NC(=O)[C@H](Cc1cnc[nH]1)NC(C)=O)C(=O)N[C@@H](CC(C)C)C(=O)N[C@@H](Cc1cnc[nH]1)C(=O)N[C@@H](CCC(N)=O)C(=O)N[C@@H](CC(C)C)C(=O)N[C@@H](CC(C)C)C(=O)N[C@@H](CCC(N)=O)C(=O)N[C@@]1(C)CCC\C=C/CCC[C@](C)(NC(=O)[C@H](CO)NC(=O)[C@H](CO)NC(=O)[C@H](CO)NC1=O)C(=O)N[C@@H](C(C)C)C(N)=O
InChI Key InChIKey=CFGHUFYGVRVKAC-USYZFREUSA-N
Data  2 Kd
  Tab Delimited (TSV)   2D SDfile   Computed 3D by Vconf -m prep SDfile
Find this compound or compounds like it in BindingDB:
Activity Spreadsheet -- Enzyme Inhibition Constant Data from BindingDB
Found 2 hits for monomerid = 50462977
TargetEstrogen receptor beta(Homo sapiens (Human))
Peking University Shenzhen Graduate School
Curated by ChEMBL
LigandPNGBDBM50462977(CHEMBL4247980)
Affinity DataKd:  2.80E+3nM. Assay description: Binding affinity to recombinant human ERbeta LBD (259 to 498 residues) C334S/C369S/C481S triple mutant expressed in Escherichia coli BL21(DE3) by sur...
Ligand InfoPC cidPC sid
In DepthDetails ArticlePubMed
TargetEstrogen receptor(Homo sapiens (Human))
Peking University Shenzhen Graduate School
Curated by ChEMBL
LigandPNGBDBM50462977(CHEMBL4247980)
Affinity DataKd:  4.00E+3nM. Assay description: Binding affinity to recombinant human ERalpha LBD (301 to 553 residues) expressed in Escherichia coli BL21(DE3) by surface plasmon resonance method
Ligand InfoPC cidPC sid
In DepthDetails ArticlePubMed