BDBM50463281 CHEMBL4240426
SMILES [H][C@@]12Oc3c4c(C[C@@]5([H])N(CC6CC6)CC[C@@]14[C@@]51CC[C@@]2(OC)[C@](C)(C1)C(=O)c1ccccc1)ccc3OC
InChI Key InChIKey=LOYLCDWZMBZEQT-MUPDXCHFSA-N
Data  3 KI  3 EC50
  Tab Delimited (TSV)   2D SDfile   Computed 3D by Vconf -m prep SDfile
Find this compound or compounds like it in BindingDB:
Activity Spreadsheet -- Enzyme Inhibition Constant Data from BindingDB
Found 6 hits for monomerid = 50463281
TargetKappa-type opioid receptor(Homo sapiens (Human))
Fudan University
Curated by ChEMBL
LigandPNGBDBM50463281(CHEMBL4240426)
Affinity DataKi:  33nM. Assay description: Displacement of [3H]U69,593 from human KOR expressed in CHO cell membranes after 30 mins by liquid scintillation counting analysis
Ligand InfoPC cidPC sid
In DepthDetails ArticlePubMed
TargetMu-type opioid receptor(Homo sapiens (Human))
Fudan University
Curated by ChEMBL
LigandPNGBDBM50463281(CHEMBL4240426)
Affinity DataKi:  304nM. Assay description: Displacement of [3H]DAMGO from human MOR expressed in CHO cell membranes after 30 mins by liquid scintillation counting analysis
Ligand InfoPC cidPC sid
In DepthDetails ArticlePubMed
TargetDelta-type opioid receptor(Homo sapiens (Human))
Fudan University
Curated by ChEMBL
LigandPNGBDBM50463281(CHEMBL4240426)
Affinity DataKi:  345nM. Assay description: Displacement of [3H]DPDPE from human DOR expressed in CHO cell membranes after 30 mins by liquid scintillation counting analysis
Ligand InfoPC cidPC sid
In DepthDetails ArticlePubMed
TargetKappa-type opioid receptor(Homo sapiens (Human))
Fudan University
Curated by ChEMBL
LigandPNGBDBM50463281(CHEMBL4240426)
Affinity DataEC50:  1.46E+3nM. Assay description: Agonist activity at human KOR expressed in CHO cell membranes after 1 hr by [35S]GTPgammaS binding based liquid scintillation counting analysis
Ligand InfoPC cidPC sid
In DepthDetails ArticlePubMed
TargetMu-type opioid receptor(Rattus norvegicus (rat))
Fudan University
Curated by ChEMBL
LigandPNGBDBM50463281(CHEMBL4240426)
Affinity DataEC50:  1.60E+3nM. Assay description: Agonist activity at rat MOR expressed in CHO cell membranes after 1 hr by [35S]GTPgammaS binding based liquid scintillation counting analysis
Ligand InfoPC cidPC sid
In DepthDetails ArticlePubMed
TargetDelta-type opioid receptor(Rattus norvegicus (rat))
Fudan University
Curated by ChEMBL
LigandPNGBDBM50463281(CHEMBL4240426)
Affinity DataEC50:  9.99E+3nM. Assay description: Agonist activity at rat DOR expressed in CHO cell membranes after 1 hr by [35S]GTPgammaS binding based liquid scintillation counting analysis
Ligand InfoPC cidPC sid
In DepthDetails ArticlePubMed